Information card for entry 4306406
Formula | C15 H24 N2 O Pt |
Calculated formula | C15 H24 N2 O Pt |
SMILES | [Pt]1([N](Cc2c1cccc2)(C)C)([NH]=C(C)C)CC(=O)C |
Title of publication | Acetonimine and 4-Imino-2-methylpentan-2-amino Platinum(II) Complexes: Synthesis and in Vitro Antitumor Activity |
Authors of publication | José Ruiz; Venancio Rodríguez; Natalia Cutillas; Gregorio López; Delia Bautista |
Journal of publication | Inorganic Chemistry |
Year of publication | 2008 |
Journal volume | 47 |
Pages of publication | 10025 - 10036 |
a | 14.0193 ± 0.0006 Å |
b | 26.1617 ± 0.0011 Å |
c | 14.202 ± 0.0006 Å |
α | 90° |
β | 112.707 ± 0.002° |
γ | 90° |
Cell volume | 4805.1 ± 0.4 Å3 |
Cell temperature | 100 ± 2 K |
Ambient diffraction temperature | 100 ± 2 K |
Number of distinct elements | 5 |
Space group number | 14 |
Hermann-Mauguin space group symbol | P 1 21/n 1 |
Hall space group symbol | -P 2yn |
Residual factor for all reflections | 0.0366 |
Residual factor for significantly intense reflections | 0.0298 |
Weighted residual factors for significantly intense reflections | 0.0675 |
Weighted residual factors for all reflections included in the refinement | 0.0702 |
Goodness-of-fit parameter for all reflections included in the refinement | 1.097 |
Diffraction radiation wavelength | 0.71073 Å |
Diffraction radiation type | MoKα |