Information card for entry 4306407
Formula | C18 H14 F10 N2 Pt |
Calculated formula | C18 H14 F10 N2 Pt |
SMILES | [Pt]([NH]=C(C)C)([NH]=C(C)C)(c1c(c(c(c(c1F)F)F)F)F)c1c(c(c(c(c1F)F)F)F)F |
Title of publication | Acetonimine and 4-Imino-2-methylpentan-2-amino Platinum(II) Complexes: Synthesis and in Vitro Antitumor Activity |
Authors of publication | José Ruiz; Venancio Rodríguez; Natalia Cutillas; Gregorio López; Delia Bautista |
Journal of publication | Inorganic Chemistry |
Year of publication | 2008 |
Journal volume | 47 |
Pages of publication | 10025 - 10036 |
a | 9.2445 ± 0.0004 Å |
b | 20.163 ± 0.0011 Å |
c | 20.8673 ± 0.001 Å |
α | 90° |
β | 91.291 ± 0.002° |
γ | 90° |
Cell volume | 3888.6 ± 0.3 Å3 |
Cell temperature | 100 ± 2 K |
Ambient diffraction temperature | 100 ± 2 K |
Number of distinct elements | 5 |
Space group number | 14 |
Hermann-Mauguin space group symbol | P 1 21/n 1 |
Hall space group symbol | -P 2yn |
Residual factor for all reflections | 0.0173 |
Residual factor for significantly intense reflections | 0.0161 |
Weighted residual factors for significantly intense reflections | 0.0382 |
Weighted residual factors for all reflections included in the refinement | 0.0386 |
Goodness-of-fit parameter for all reflections included in the refinement | 1.123 |
Diffraction radiation wavelength | 0.71073 Å |
Diffraction radiation type | MoKα |