Information card for entry 4306409
Formula | C36 H46 Cl N2 O6 P Pt |
Calculated formula | C36 H46 Cl N2 O6 P Pt |
Title of publication | Acetonimine and 4-Imino-2-methylpentan-2-amino Platinum(II) Complexes: Synthesis and in Vitro Antitumor Activity |
Authors of publication | José Ruiz; Venancio Rodríguez; Natalia Cutillas; Gregorio López; Delia Bautista |
Journal of publication | Inorganic Chemistry |
Year of publication | 2008 |
Journal volume | 47 |
Pages of publication | 10025 - 10036 |
a | 9.5629 ± 0.0004 Å |
b | 12.3783 ± 0.0005 Å |
c | 16.8813 ± 0.0007 Å |
α | 70.351 ± 0.002° |
β | 77.702 ± 0.002° |
γ | 85.013 ± 0.002° |
Cell volume | 1838.48 ± 0.13 Å3 |
Cell temperature | 100 ± 2 K |
Ambient diffraction temperature | 100 ± 2 K |
Number of distinct elements | 7 |
Space group number | 2 |
Hermann-Mauguin space group symbol | P -1 |
Hall space group symbol | -P 1 |
Residual factor for all reflections | 0.0207 |
Residual factor for significantly intense reflections | 0.0199 |
Weighted residual factors for significantly intense reflections | 0.0476 |
Weighted residual factors for all reflections included in the refinement | 0.048 |
Goodness-of-fit parameter for all reflections included in the refinement | 1.06 |
Diffraction radiation wavelength | 0.71073 Å |
Diffraction radiation type | MoKα |