Information card for entry 4306408
Formula | C15 H26 Cl N3 O4 Pt |
Calculated formula | C15 H26 Cl N3 O4 Pt |
SMILES | [Pt]1([N](Cc2c1cccc2)(C)C)([NH]=C(C)C)[NH]=C(C)C.Cl(=O)(=O)(=O)[O-] |
Title of publication | Acetonimine and 4-Imino-2-methylpentan-2-amino Platinum(II) Complexes: Synthesis and in Vitro Antitumor Activity |
Authors of publication | José Ruiz; Venancio Rodríguez; Natalia Cutillas; Gregorio López; Delia Bautista |
Journal of publication | Inorganic Chemistry |
Year of publication | 2008 |
Journal volume | 47 |
Pages of publication | 10025 - 10036 |
a | 9.0918 ± 0.0003 Å |
b | 9.5904 ± 0.0004 Å |
c | 12.4696 ± 0.0005 Å |
α | 80.297 ± 0.002° |
β | 72.744 ± 0.002° |
γ | 65.489 ± 0.002° |
Cell volume | 943.47 ± 0.07 Å3 |
Cell temperature | 100 ± 2 K |
Ambient diffraction temperature | 100 ± 2 K |
Number of distinct elements | 6 |
Space group number | 2 |
Hermann-Mauguin space group symbol | P -1 |
Hall space group symbol | -P 1 |
Residual factor for all reflections | 0.0202 |
Residual factor for significantly intense reflections | 0.0195 |
Weighted residual factors for significantly intense reflections | 0.0484 |
Weighted residual factors for all reflections included in the refinement | 0.0487 |
Goodness-of-fit parameter for all reflections included in the refinement | 1.117 |
Diffraction radiation wavelength | 0.71073 Å |
Diffraction radiation type | MoKα |