Information card for entry 4306469
Formula | C58 H48 Cd2 N8 O10 |
Calculated formula | C58 H48 Cd2 N8 O10 |
Title of publication | Self-Assembly of 2D\ρightarrow2D Interpenetrating Coordination Polymers Showing Polyrotaxane- and Polycatenane-like Motifs: Influence of Various Ligands on Topological Structural Diversity |
Authors of publication | Ya-Qian Lan; Shun-Li Li; Jun-Sheng Qin; Dong-Ying Du; Xin-Long Wang; Zhong-Min Su; Qiang Fu |
Journal of publication | Inorganic Chemistry |
Year of publication | 2008 |
Journal volume | 47 |
Pages of publication | 10600 - 10610 |
a | 9.786 ± 0.0006 Å |
b | 14.746 ± 0.0009 Å |
c | 19.872 ± 0.0012 Å |
α | 100.746 ± 0.001° |
β | 97.924 ± 0.001° |
γ | 100.696 ± 0.001° |
Cell volume | 2723.8 ± 0.3 Å3 |
Cell temperature | 293 ± 2 K |
Ambient diffraction temperature | 293 ± 2 K |
Number of distinct elements | 5 |
Space group number | 2 |
Hermann-Mauguin space group symbol | P -1 |
Hall space group symbol | -P 1 |
Residual factor for all reflections | 0.0766 |
Residual factor for significantly intense reflections | 0.0458 |
Weighted residual factors for significantly intense reflections | 0.0976 |
Weighted residual factors for all reflections included in the refinement | 0.1117 |
Goodness-of-fit parameter for all reflections included in the refinement | 1.042 |
Diffraction radiation wavelength | 0.71069 Å |
Diffraction radiation type | MoKα |