Information card for entry 4306470
Formula | C27 H22 Cd N3 O7 |
Calculated formula | C27 H22 Cd N3 O7 |
Title of publication | Self-Assembly of 2D\ρightarrow2D Interpenetrating Coordination Polymers Showing Polyrotaxane- and Polycatenane-like Motifs: Influence of Various Ligands on Topological Structural Diversity |
Authors of publication | Ya-Qian Lan; Shun-Li Li; Jun-Sheng Qin; Dong-Ying Du; Xin-Long Wang; Zhong-Min Su; Qiang Fu |
Journal of publication | Inorganic Chemistry |
Year of publication | 2008 |
Journal volume | 47 |
Pages of publication | 10600 - 10610 |
a | 10.393 ± 0.0005 Å |
b | 11.029 ± 0.0005 Å |
c | 12.099 ± 0.0005 Å |
α | 110.625 ± 0.001° |
β | 105.671 ± 0.001° |
γ | 93.457 ± 0.001° |
Cell volume | 1230.97 ± 0.1 Å3 |
Cell temperature | 293 ± 2 K |
Ambient diffraction temperature | 293 ± 2 K |
Number of distinct elements | 5 |
Space group number | 2 |
Hermann-Mauguin space group symbol | P -1 |
Hall space group symbol | -P 1 |
Residual factor for all reflections | 0.0388 |
Residual factor for significantly intense reflections | 0.0358 |
Weighted residual factors for significantly intense reflections | 0.095 |
Weighted residual factors for all reflections included in the refinement | 0.0971 |
Goodness-of-fit parameter for all reflections included in the refinement | 1.034 |
Diffraction radiation wavelength | 0.71069 Å |
Diffraction radiation type | MoKα |