Information card for entry 4306473
Formula | C28 H30 Cd N4 O7 |
Calculated formula | C28 H30 Cd N4 O7 |
Title of publication | Self-Assembly of 2D\ρightarrow2D Interpenetrating Coordination Polymers Showing Polyrotaxane- and Polycatenane-like Motifs: Influence of Various Ligands on Topological Structural Diversity |
Authors of publication | Ya-Qian Lan; Shun-Li Li; Jun-Sheng Qin; Dong-Ying Du; Xin-Long Wang; Zhong-Min Su; Qiang Fu |
Journal of publication | Inorganic Chemistry |
Year of publication | 2008 |
Journal volume | 47 |
Pages of publication | 10600 - 10610 |
a | 7.168 ± 0.0003 Å |
b | 24.887 ± 0.0006 Å |
c | 15.439 ± 0.0007 Å |
α | 90° |
β | 91.014 ± 0.001° |
γ | 90° |
Cell volume | 2753.73 ± 0.18 Å3 |
Cell temperature | 293 ± 2 K |
Ambient diffraction temperature | 293 ± 2 K |
Number of distinct elements | 5 |
Space group number | 14 |
Hermann-Mauguin space group symbol | P 1 21/n 1 |
Hall space group symbol | -P 2yn |
Residual factor for all reflections | 0.0499 |
Residual factor for significantly intense reflections | 0.039 |
Weighted residual factors for significantly intense reflections | 0.0878 |
Weighted residual factors for all reflections included in the refinement | 0.0929 |
Goodness-of-fit parameter for all reflections included in the refinement | 1.035 |
Diffraction radiation wavelength | 0.71069 Å |
Diffraction radiation type | MoKα |