Information card for entry 4306472
Formula | C28 H26 N3 O7 Zn |
Calculated formula | C28 H26 N3 O7 Zn |
Title of publication | Self-Assembly of 2D\ρightarrow2D Interpenetrating Coordination Polymers Showing Polyrotaxane- and Polycatenane-like Motifs: Influence of Various Ligands on Topological Structural Diversity |
Authors of publication | Ya-Qian Lan; Shun-Li Li; Jun-Sheng Qin; Dong-Ying Du; Xin-Long Wang; Zhong-Min Su; Qiang Fu |
Journal of publication | Inorganic Chemistry |
Year of publication | 2008 |
Journal volume | 47 |
Pages of publication | 10600 - 10610 |
a | 8.22 ± 0.0003 Å |
b | 12.446 ± 0.0005 Å |
c | 13.547 ± 0.0005 Å |
α | 98.691 ± 0.0006° |
β | 98.826 ± 0.001° |
γ | 109.26 ± 0.001° |
Cell volume | 1262.29 ± 0.08 Å3 |
Cell temperature | 293 ± 2 K |
Ambient diffraction temperature | 293 ± 2 K |
Number of distinct elements | 5 |
Space group number | 2 |
Hermann-Mauguin space group symbol | P -1 |
Hall space group symbol | -P 1 |
Residual factor for all reflections | 0.0301 |
Residual factor for significantly intense reflections | 0.0271 |
Weighted residual factors for significantly intense reflections | 0.0687 |
Weighted residual factors for all reflections included in the refinement | 0.0703 |
Goodness-of-fit parameter for all reflections included in the refinement | 1.051 |
Diffraction radiation wavelength | 0.71069 Å |
Diffraction radiation type | MoKα |