Information card for entry 4306496
Chemical name | hexa(hexafluoroacetylacetonate)-trimanganese(II,II,II) |
Formula | C30 H6 F36 Mn3 O12 |
Calculated formula | C30 H6 F36 Mn3 O12 |
Title of publication | Fluorinated β-Diketonates of the First Row Divalent Transition Metals: New Approach to the Synthesis of Unsolvated Species |
Authors of publication | Haitao Zhang; Bo Li; Jinyu Sun; Rodolphe Clérac; Evgeny V. Dikarev |
Journal of publication | Inorganic Chemistry |
Year of publication | 2008 |
Journal volume | 47 |
Pages of publication | 10046 - 10052 |
a | 11.1975 ± 0.0013 Å |
b | 11.1975 ± 0.0013 Å |
c | 11.1975 ± 0.0013 Å |
α | 109.942 ± 0.017° |
β | 109.942 ± 0.017° |
γ | 109.942 ± 0.017° |
Cell volume | 1061.5 ± 0.5 Å3 |
Cell temperature | 173 ± 2 K |
Ambient diffraction temperature | 173 ± 2 K |
Number of distinct elements | 5 |
Space group number | 167 |
Hermann-Mauguin space group symbol | R -3 c :R |
Hall space group symbol | -P 3* 2n |
Residual factor for all reflections | 0.0726 |
Residual factor for significantly intense reflections | 0.0608 |
Weighted residual factors for significantly intense reflections | 0.1252 |
Weighted residual factors for all reflections included in the refinement | 0.1296 |
Goodness-of-fit parameter for all reflections included in the refinement | 1.2 |
Diffraction radiation wavelength | 0.71073 Å |
Diffraction radiation type | MoKα |