Information card for entry 4306497
Chemical name | tetra(hexafluoroacetylacetonate)-diiron(II,II) |
Formula | C20 H4 F24 Fe2 O8 |
Calculated formula | C20 H4 F24 Fe2 O8 |
Title of publication | Fluorinated β-Diketonates of the First Row Divalent Transition Metals: New Approach to the Synthesis of Unsolvated Species |
Authors of publication | Haitao Zhang; Bo Li; Jinyu Sun; Rodolphe Clérac; Evgeny V. Dikarev |
Journal of publication | Inorganic Chemistry |
Year of publication | 2008 |
Journal volume | 47 |
Pages of publication | 10046 - 10052 |
a | 20.479 ± 0.003 Å |
b | 7.6582 ± 0.001 Å |
c | 20.546 ± 0.003 Å |
α | 90° |
β | 108.853 ± 0.001° |
γ | 90° |
Cell volume | 3049.4 ± 0.7 Å3 |
Cell temperature | 173 ± 2 K |
Ambient diffraction temperature | 173 ± 2 K |
Number of distinct elements | 5 |
Space group number | 15 |
Hermann-Mauguin space group symbol | C 1 2/c 1 |
Hall space group symbol | -C 2yc |
Residual factor for all reflections | 0.0836 |
Residual factor for significantly intense reflections | 0.0766 |
Weighted residual factors for significantly intense reflections | 0.2063 |
Weighted residual factors for all reflections included in the refinement | 0.2138 |
Goodness-of-fit parameter for all reflections included in the refinement | 1.124 |
Diffraction radiation wavelength | 0.71073 Å |
Diffraction radiation type | MoKα |