Information card for entry 4306498
Chemical name | hexa(hexafluoroacetylacetonate)-tricobalt(II,II,II) |
Formula | C30 H6 Co3 F36 O12 |
Calculated formula | C30 H6 Co3 F36 O12 |
Title of publication | Fluorinated β-Diketonates of the First Row Divalent Transition Metals: New Approach to the Synthesis of Unsolvated Species |
Authors of publication | Haitao Zhang; Bo Li; Jinyu Sun; Rodolphe Clérac; Evgeny V. Dikarev |
Journal of publication | Inorganic Chemistry |
Year of publication | 2008 |
Journal volume | 47 |
Pages of publication | 10046 - 10052 |
a | 17.6557 ± 0.0015 Å |
b | 16.2242 ± 0.0014 Å |
c | 16.9102 ± 0.0015 Å |
α | 90° |
β | 115.201 ± 0.001° |
γ | 90° |
Cell volume | 4382.9 ± 0.7 Å3 |
Cell temperature | 90 ± 2 K |
Ambient diffraction temperature | 90 ± 2 K |
Number of distinct elements | 5 |
Space group number | 14 |
Hermann-Mauguin space group symbol | P 1 21/c 1 |
Hall space group symbol | -P 2ybc |
Residual factor for all reflections | 0.0707 |
Residual factor for significantly intense reflections | 0.0425 |
Weighted residual factors for significantly intense reflections | 0.0896 |
Weighted residual factors for all reflections included in the refinement | 0.1021 |
Goodness-of-fit parameter for all reflections included in the refinement | 1.005 |
Diffraction radiation wavelength | 0.71073 Å |
Diffraction radiation type | MoKα |