Information card for entry 4306504
Formula | C45 H57 O3 P3 Ru Si3 |
Calculated formula | C45 H57 O3 P3 Ru Si3 |
SMILES | C1O[Si](C)(C)[RuH]2([H][Si](C)(C)OC[P]2(c2ccccc2)c2ccccc2)([P]1(c1ccccc1)c1ccccc1)[P](CO[SiH](C)C)(c1ccccc1)c1ccccc1 |
Title of publication | Bonding Mode of a Bifunctional P~Si-H Ligand in the Ruthenium Complex "Ru(PPh2CH2OSiMe2H)3" |
Authors of publication | Virginia Montiel-Palma; Olivier Piechaczyk; Alexandre Picot; Audrey Auffrant; Laure Vendier; Pascal Le Floch; Sylviane Sabo-Etienne |
Journal of publication | Inorganic Chemistry |
Year of publication | 2008 |
Journal volume | 47 |
Pages of publication | 8601 - 8603 |
a | 16.8397 ± 0.0012 Å |
b | 13.073 ± 0.0009 Å |
c | 20.426 ± 0.002 Å |
α | 90° |
β | 98.447 ± 0.007° |
γ | 90° |
Cell volume | 4447.9 ± 0.6 Å3 |
Cell temperature | 101.5 K |
Ambient diffraction temperature | 101.5 K |
Number of distinct elements | 6 |
Space group number | 14 |
Hermann-Mauguin space group symbol | P 1 21/n 1 |
Hall space group symbol | -P 2yn |
Residual factor for all reflections | 0.1105 |
Residual factor for significantly intense reflections | 0.039 |
Weighted residual factors for significantly intense reflections | 0.0572 |
Weighted residual factors for all reflections included in the refinement | 0.0688 |
Goodness-of-fit parameter for all reflections included in the refinement | 0.803 |
Diffraction radiation type | MoKα |