Information card for entry 4306505
Formula | C16 H28 Cl2 N2 O3 Zn |
Calculated formula | C16 H26 Cl2 N2 O3 Zn |
Title of publication | Four Zinc(II) Helical Coordination Polymers and 78-Membered Six-Node Zinc Metallacycle Assembled from Diastereopure N,N'-Bis(acetylacetone)cyclohexanediimine |
Authors of publication | Bi-Xue Zhu; Qi-Long Zhang; Yun-Qian Zhang; Tao Zhu; Jack K. Clegg; Leonard F. Lindoy; Gang Wei |
Journal of publication | Inorganic Chemistry |
Year of publication | 2008 |
Journal volume | 47 |
Pages of publication | 10053 - 10061 |
a | 8.904 ± 0.004 Å |
b | 13.909 ± 0.006 Å |
c | 17.082 ± 0.008 Å |
α | 90° |
β | 90° |
γ | 90° |
Cell volume | 2115.5 ± 1.6 Å3 |
Cell temperature | 293 ± 2 K |
Ambient diffraction temperature | 293 ± 2 K |
Number of distinct elements | 6 |
Space group number | 19 |
Hermann-Mauguin space group symbol | P 21 21 21 |
Hall space group symbol | P 2ac 2ab |
Residual factor for all reflections | 0.0857 |
Residual factor for significantly intense reflections | 0.0541 |
Weighted residual factors for significantly intense reflections | 0.1504 |
Weighted residual factors for all reflections included in the refinement | 0.1648 |
Goodness-of-fit parameter for all reflections included in the refinement | 1.082 |
Diffraction radiation wavelength | 0.71073 Å |
Diffraction radiation type | MoKα |