Information card for entry 4306507
Formula | C16 H26 Cl2 N2 O2 Zn |
Calculated formula | C16 H26 Cl2 N2 O2 Zn |
Title of publication | Four Zinc(II) Helical Coordination Polymers and 78-Membered Six-Node Zinc Metallacycle Assembled from Diastereopure N,N'-Bis(acetylacetone)cyclohexanediimine |
Authors of publication | Bi-Xue Zhu; Qi-Long Zhang; Yun-Qian Zhang; Tao Zhu; Jack K. Clegg; Leonard F. Lindoy; Gang Wei |
Journal of publication | Inorganic Chemistry |
Year of publication | 2008 |
Journal volume | 47 |
Pages of publication | 10053 - 10061 |
a | 16.181 ± 0.003 Å |
b | 17.327 ± 0.003 Å |
c | 27.663 ± 0.006 Å |
α | 90° |
β | 90° |
γ | 90° |
Cell volume | 7756 ± 3 Å3 |
Cell temperature | 293 ± 2 K |
Ambient diffraction temperature | 293 ± 2 K |
Number of distinct elements | 6 |
Space group number | 70 |
Hermann-Mauguin space group symbol | F d d d :2 |
Hall space group symbol | -F 2uv 2vw |
Residual factor for all reflections | 0.0308 |
Residual factor for significantly intense reflections | 0.0243 |
Weighted residual factors for significantly intense reflections | 0.0672 |
Weighted residual factors for all reflections included in the refinement | 0.0698 |
Goodness-of-fit parameter for all reflections included in the refinement | 1.063 |
Diffraction radiation wavelength | 0.71073 Å |
Diffraction radiation type | MoKα |