Information card for entry 4306506
Formula | C16 H28 Cl2 N2 O3 Zn |
Calculated formula | C16 H26 Cl2 N2 O3 Zn |
Title of publication | Four Zinc(II) Helical Coordination Polymers and 78-Membered Six-Node Zinc Metallacycle Assembled from Diastereopure N,N'-Bis(acetylacetone)cyclohexanediimine |
Authors of publication | Bi-Xue Zhu; Qi-Long Zhang; Yun-Qian Zhang; Tao Zhu; Jack K. Clegg; Leonard F. Lindoy; Gang Wei |
Journal of publication | Inorganic Chemistry |
Year of publication | 2008 |
Journal volume | 47 |
Pages of publication | 10053 - 10061 |
a | 8.8874 ± 0.0005 Å |
b | 13.7594 ± 0.0007 Å |
c | 17.0043 ± 0.0009 Å |
α | 90° |
β | 90° |
γ | 90° |
Cell volume | 2079.38 ± 0.19 Å3 |
Cell temperature | 293 ± 2 K |
Ambient diffraction temperature | 293 ± 2 K |
Number of distinct elements | 6 |
Space group number | 19 |
Hermann-Mauguin space group symbol | P 21 21 21 |
Hall space group symbol | P 2ac 2ab |
Residual factor for all reflections | 0.0467 |
Residual factor for significantly intense reflections | 0.0429 |
Weighted residual factors for significantly intense reflections | 0.1081 |
Weighted residual factors for all reflections included in the refinement | 0.1107 |
Goodness-of-fit parameter for all reflections included in the refinement | 1.02 |
Diffraction radiation wavelength | 0.71073 Å |
Diffraction radiation type | MoKα |