Information card for entry 4306607
Formula | C12 H18 Cl4 Na20 Ni8 O115.5 Si2 W18 |
Calculated formula | C12 H18 Cl4 Na19.96 Ni8 O115.48 Si2 W18 |
Title of publication | Octa- and Nonanuclear Nickel(II) Polyoxometalate Clusters: Synthesis and Electrochemical and Magnetic Characterizations |
Authors of publication | Céline Pichon; Pierre Mialane; Anne Dolbecq; Jérôme Marrot; Eric Rivière; Bassem S. Bassil; Ulrich Kortz; Bineta Keita; Louis Nadjo; Francis Sécheresse |
Journal of publication | Inorganic Chemistry |
Year of publication | 2008 |
Journal volume | 47 |
Pages of publication | 11120 - 11128 |
a | 11.9272 ± 0.0001 Å |
b | 11.9272 ± 0.0001 Å |
c | 48.4712 ± 0.0011 Å |
α | 90° |
β | 90° |
γ | 120° |
Cell volume | 5971.61 ± 0.15 Å3 |
Cell temperature | 293 ± 2 K |
Ambient diffraction temperature | 293 ± 2 K |
Number of distinct elements | 8 |
Space group number | 163 |
Hermann-Mauguin space group symbol | P -3 1 c |
Hall space group symbol | -P 3 2c |
Residual factor for all reflections | 0.0858 |
Residual factor for significantly intense reflections | 0.0773 |
Weighted residual factors for significantly intense reflections | 0.2133 |
Weighted residual factors for all reflections included in the refinement | 0.2342 |
Goodness-of-fit parameter for all reflections included in the refinement | 1.095 |
Diffraction radiation wavelength | 0.71073 Å |
Diffraction radiation type | MoKα |