Information card for entry 4306608
Formula | C12 H18 N6 Na16 Ni8 O121 Si2 W18 |
Calculated formula | C12 H18 N5.94 Na16 Ni8 O120.98 Si2 W18 |
Title of publication | Octa- and Nonanuclear Nickel(II) Polyoxometalate Clusters: Synthesis and Electrochemical and Magnetic Characterizations |
Authors of publication | Céline Pichon; Pierre Mialane; Anne Dolbecq; Jérôme Marrot; Eric Rivière; Bassem S. Bassil; Ulrich Kortz; Bineta Keita; Louis Nadjo; Francis Sécheresse |
Journal of publication | Inorganic Chemistry |
Year of publication | 2008 |
Journal volume | 47 |
Pages of publication | 11120 - 11128 |
a | 11.966 ± 0.0007 Å |
b | 11.966 ± 0.0007 Å |
c | 72.753 ± 0.007 Å |
α | 90° |
β | 90° |
γ | 120° |
Cell volume | 9021.5 ± 1.1 Å3 |
Cell temperature | 100 ± 2 K |
Ambient diffraction temperature | 100 ± 2 K |
Number of distinct elements | 8 |
Space group number | 148 |
Hermann-Mauguin space group symbol | R -3 :H |
Hall space group symbol | -R 3 |
Residual factor for all reflections | 0.0337 |
Residual factor for significantly intense reflections | 0.0271 |
Weighted residual factors for significantly intense reflections | 0.0855 |
Weighted residual factors for all reflections included in the refinement | 0.1012 |
Goodness-of-fit parameter for all reflections included in the refinement | 1.263 |
Diffraction radiation wavelength | 0.71073 Å |
Diffraction radiation type | MoKα |