Information card for entry 4306612
Common name | Dy(^i^PrN)~2~CNMe~2~ (1c) |
Formula | C27 H60 Dy N9 |
Calculated formula | C27 H60 Dy N9 |
SMILES | [Dy]123([N](=C(N1C(C)C)N(C)C)C(C)C)([N](=C(N2C(C)C)N(C)C)C(C)C)[N](=C(N3C(C)C)N(C)C)C(C)C |
Title of publication | Synthesis, Characterization, and Thermal Properties of Homoleptic Rare-Earth Guanidinates: Promising Precursors for MOCVD and ALD of Rare-Earth Oxide Thin Films |
Authors of publication | Andrian P. Milanov; Roland A. Fischer; Anjana Devi |
Journal of publication | Inorganic Chemistry |
Year of publication | 2008 |
Journal volume | 47 |
Pages of publication | 11405 - 11416 |
a | 10.7312 ± 0.0003 Å |
b | 11.2048 ± 0.0003 Å |
c | 16.1286 ± 0.0005 Å |
α | 91.639 ± 0.002° |
β | 95.779 ± 0.002° |
γ | 115.322 ± 0.003° |
Cell volume | 1738.53 ± 0.1 Å3 |
Cell temperature | 113 ± 2 K |
Ambient diffraction temperature | 113 ± 2 K |
Number of distinct elements | 4 |
Space group number | 2 |
Hermann-Mauguin space group symbol | P -1 |
Hall space group symbol | -P 1 |
Residual factor for all reflections | 0.0289 |
Residual factor for significantly intense reflections | 0.0219 |
Weighted residual factors for significantly intense reflections | 0.0456 |
Weighted residual factors for all reflections included in the refinement | 0.0485 |
Goodness-of-fit parameter for all reflections included in the refinement | 1.011 |
Diffraction radiation wavelength | 0.71073 Å |
Diffraction radiation type | MoKα |