Information card for entry 4306613
Common name | Y(^i^PrN)~2~CNEt~2~ (2a) |
Formula | C39 H84 N9 Y |
Calculated formula | C39 H84 N9 Y |
SMILES | C1(=[N]([Y]234([N](C(C)C)=C(N3C(C)C)N(CC)CC)([N]1C(C)C)=C(N4C(C)C)(N2C(C)C)N(CC)CC)C(C)C)N(CC)CC.C1CCCCC1 |
Title of publication | Synthesis, Characterization, and Thermal Properties of Homoleptic Rare-Earth Guanidinates: Promising Precursors for MOCVD and ALD of Rare-Earth Oxide Thin Films |
Authors of publication | Andrian P. Milanov; Roland A. Fischer; Anjana Devi |
Journal of publication | Inorganic Chemistry |
Year of publication | 2008 |
Journal volume | 47 |
Pages of publication | 11405 - 11416 |
a | 22.31 ± 0.01 Å |
b | 13.165 ± 0.003 Å |
c | 17.466 ± 0.005 Å |
α | 90° |
β | 114.43 ± 0.03° |
γ | 90° |
Cell volume | 4671 ± 3 Å3 |
Cell temperature | 113 ± 2 K |
Ambient diffraction temperature | 113 ± 2 K |
Number of distinct elements | 4 |
Space group number | 15 |
Hermann-Mauguin space group symbol | C 1 2/c 1 |
Hall space group symbol | -C 2yc |
Residual factor for all reflections | 0.1309 |
Residual factor for significantly intense reflections | 0.0642 |
Weighted residual factors for significantly intense reflections | 0.1412 |
Weighted residual factors for all reflections included in the refinement | 0.1538 |
Goodness-of-fit parameter for all reflections included in the refinement | 0.783 |
Diffraction radiation wavelength | 0.71073 Å |
Diffraction radiation type | MoKα |