Information card for entry 4306617
Common name | Dy(^i^PrN)~2~CN^i^Pr~2~ (3c) |
Formula | C45 H94 Dy N9 |
Calculated formula | C45 H94 Dy N9 |
SMILES | C1(=[N](C(C)C)[Dy]23(N1C(C)C)([N](=C(N(C(C)C)C(C)C)N3C(C)C)C(C)C)[N](=C(N2C(C)C)N(C(C)C)C(C)C)C(C)C)N(C(C)C)C(C)C.C1CCCCC1 |
Title of publication | Synthesis, Characterization, and Thermal Properties of Homoleptic Rare-Earth Guanidinates: Promising Precursors for MOCVD and ALD of Rare-Earth Oxide Thin Films |
Authors of publication | Andrian P. Milanov; Roland A. Fischer; Anjana Devi |
Journal of publication | Inorganic Chemistry |
Year of publication | 2008 |
Journal volume | 47 |
Pages of publication | 11405 - 11416 |
a | 23.061 ± 0.004 Å |
b | 13.3482 ± 0.001 Å |
c | 19.5859 ± 0.0018 Å |
α | 90° |
β | 118.741 ± 0.008° |
γ | 90° |
Cell volume | 5286.2 ± 1.2 Å3 |
Cell temperature | 113 ± 2 K |
Ambient diffraction temperature | 113 ± 2 K |
Number of distinct elements | 4 |
Space group number | 15 |
Hermann-Mauguin space group symbol | C 1 2/c 1 |
Hall space group symbol | -C 2yc |
Residual factor for all reflections | 0.0374 |
Residual factor for significantly intense reflections | 0.0303 |
Weighted residual factors for significantly intense reflections | 0.0763 |
Weighted residual factors for all reflections included in the refinement | 0.0778 |
Goodness-of-fit parameter for all reflections included in the refinement | 1.021 |
Diffraction radiation wavelength | 0.71073 Å |
Diffraction radiation type | MoKα |