Information card for entry 4306800
Formula | C80 H60 N16 O P2 W2 |
Calculated formula | C80 H50 N16 O P2 W2 |
Title of publication | Intermolecular Contact-Tuned Magnetic Nature in One-Dimensional 3d-5d Bimetallic Systems: From a Metamagnet to a Single-Chain Magnet |
Authors of publication | Seok Woo Choi; Hyun Young Kwak; Jung Hee Yoon; Hyoung Chan Kim; Eui Kwan Koh; Chang Seop Hong |
Journal of publication | Inorganic Chemistry |
Year of publication | 2008 |
Journal volume | 47 |
Pages of publication | 10214 - 10216 |
a | 9.2764 ± 0.0017 Å |
b | 14.473 ± 0.003 Å |
c | 14.995 ± 0.003 Å |
α | 113.034 ± 0.006° |
β | 97.37 ± 0.006° |
γ | 97.22 ± 0.006° |
Cell volume | 1802.9 ± 0.6 Å3 |
Cell temperature | 293 ± 2 K |
Ambient diffraction temperature | 293 ± 2 K |
Number of distinct elements | 6 |
Space group number | 2 |
Hermann-Mauguin space group symbol | P -1 |
Hall space group symbol | -P 1 |
Residual factor for all reflections | 0.1139 |
Residual factor for significantly intense reflections | 0.0473 |
Weighted residual factors for significantly intense reflections | 0.0648 |
Weighted residual factors for all reflections included in the refinement | 0.0799 |
Goodness-of-fit parameter for all reflections included in the refinement | 1.009 |
Diffraction radiation wavelength | 0.71073 Å |
Diffraction radiation type | MoKα |