Information card for entry 4306801
Formula | C45 H37 Mn N11 O3 W |
Calculated formula | C45 H37 Mn N11 O3 W |
Title of publication | Intermolecular Contact-Tuned Magnetic Nature in One-Dimensional 3d-5d Bimetallic Systems: From a Metamagnet to a Single-Chain Magnet |
Authors of publication | Seok Woo Choi; Hyun Young Kwak; Jung Hee Yoon; Hyoung Chan Kim; Eui Kwan Koh; Chang Seop Hong |
Journal of publication | Inorganic Chemistry |
Year of publication | 2008 |
Journal volume | 47 |
Pages of publication | 10214 - 10216 |
a | 14.541 ± 0.0003 Å |
b | 19.3159 ± 0.0005 Å |
c | 14.9197 ± 0.0003 Å |
α | 90° |
β | 94.154 ± 0.001° |
γ | 90° |
Cell volume | 4179.52 ± 0.16 Å3 |
Cell temperature | 293 ± 2 K |
Ambient diffraction temperature | 293 ± 2 K |
Number of distinct elements | 6 |
Space group number | 14 |
Hermann-Mauguin space group symbol | P 1 21/n 1 |
Hall space group symbol | -P 2yn |
Residual factor for all reflections | 0.0571 |
Residual factor for significantly intense reflections | 0.0349 |
Weighted residual factors for significantly intense reflections | 0.054 |
Weighted residual factors for all reflections included in the refinement | 0.0595 |
Goodness-of-fit parameter for all reflections included in the refinement | 1.028 |
Diffraction radiation wavelength | 0.71073 Å |
Diffraction radiation type | MoKα |