Information card for entry 4307952
Common name | [Mo2(DAniF)3]2O2 |
Formula | C90 H90 Mo4 N12 O14 |
Calculated formula | C90 H90 Mo4 N12 O14 |
Title of publication | Crystal-to-Crystal Oxidative Deprotonation of a Di(μ-hydroxo) to a Di(μ-oxo) Dimer of Dimolybdenum Units |
Authors of publication | F. Albert Cotton; Zhong Li; Carlos A. Murillo; Xiaoping Wang; Rongmin Yu; Qinliang Zhao |
Journal of publication | Inorganic Chemistry |
Year of publication | 2007 |
Journal volume | 46 |
Pages of publication | 3245 - 3250 |
a | 14.736 ± 0.003 Å |
b | 17.278 ± 0.004 Å |
c | 17.59 ± 0.004 Å |
α | 91.605 ± 0.004° |
β | 90.926 ± 0.004° |
γ | 96.177 ± 0.004° |
Cell volume | 4450 ± 1.7 Å3 |
Cell temperature | 213 ± 2 K |
Ambient diffraction temperature | 213 ± 2 K |
Number of distinct elements | 5 |
Space group number | 2 |
Hermann-Mauguin space group symbol | P -1 |
Hall space group symbol | -P 1 |
Residual factor for all reflections | 0.162 |
Residual factor for significantly intense reflections | 0.0758 |
Weighted residual factors for significantly intense reflections | 0.194 |
Weighted residual factors for all reflections included in the refinement | 0.2614 |
Goodness-of-fit parameter for all reflections included in the refinement | 1.073 |
Diffraction radiation wavelength | 0.71073 Å |
Diffraction radiation type | MoKα |