Information card for entry 4307953
Common name | [Mo2(DAniF)3]2O2,2CH2Cl2 |
Formula | C92 H94 Cl4 Mo4 N12 O14 |
Calculated formula | C91.998 H93.996 Cl3.996 Mo4 N12 O14 |
Title of publication | Crystal-to-Crystal Oxidative Deprotonation of a Di(μ-hydroxo) to a Di(μ-oxo) Dimer of Dimolybdenum Units |
Authors of publication | F. Albert Cotton; Zhong Li; Carlos A. Murillo; Xiaoping Wang; Rongmin Yu; Qinliang Zhao |
Journal of publication | Inorganic Chemistry |
Year of publication | 2007 |
Journal volume | 46 |
Pages of publication | 3245 - 3250 |
a | 12.973 ± 0.005 Å |
b | 14.045 ± 0.005 Å |
c | 14.046 ± 0.005 Å |
α | 71.25 ± 0.006° |
β | 73.612 ± 0.006° |
γ | 87.71 ± 0.006° |
Cell volume | 2321.4 ± 1.5 Å3 |
Cell temperature | 213 ± 2 K |
Ambient diffraction temperature | 213 ± 2 K |
Number of distinct elements | 6 |
Space group number | 2 |
Hermann-Mauguin space group symbol | P -1 |
Hall space group symbol | -P 1 |
Residual factor for all reflections | 0.0353 |
Residual factor for significantly intense reflections | 0.0275 |
Weighted residual factors for significantly intense reflections | 0.066 |
Weighted residual factors for all reflections included in the refinement | 0.0715 |
Goodness-of-fit parameter for all reflections included in the refinement | 1.036 |
Diffraction radiation wavelength | 0.71073 Å |
Diffraction radiation type | MoKα |