Information card for entry 4311383
Formula | C32 H62 B N Ni P3 |
Calculated formula | C32 H62 B N Ni P3 |
Title of publication | The Coordination Chemistry of "[BP3]NiX" Platforms: Targeting Low-Valent Nickel Sources as Promising Candidates to L3NiE and L3Ni\τbE Linkages |
Authors of publication | Cora E. MacBeth; J. Christopher Thomas; Theodore A. Betley; Jonas C. Peters |
Journal of publication | Inorganic Chemistry |
Year of publication | 2004 |
Journal volume | 43 |
Pages of publication | 4645 - 4662 |
a | 9.63 ± 0.0007 Å |
b | 12.2632 ± 0.0009 Å |
c | 15.4425 ± 0.0011 Å |
α | 87.053 ± 0.001° |
β | 80.119 ± 0.001° |
γ | 84.968 ± 0.001° |
Cell volume | 1788.5 ± 0.2 Å3 |
Cell temperature | 100 ± 2 K |
Ambient diffraction temperature | 100 ± 2 K |
Number of distinct elements | 6 |
Space group number | 2 |
Hermann-Mauguin space group symbol | P -1 |
Hall space group symbol | -P 1 |
Residual factor for all reflections | 0.0557 |
Residual factor for significantly intense reflections | 0.041 |
Weighted residual factors for significantly intense reflections | 0.0876 |
Weighted residual factors for all reflections included in the refinement | 0.0909 |
Goodness-of-fit parameter for all reflections included in the refinement | 1.674 |
Diffraction radiation wavelength | 0.71073 Å |
Diffraction radiation type | MoKα |