Information card for entry 4311384
Formula | C45 H41 B N Ni O P3 |
Calculated formula | C45 H41 B N Ni O P3 |
SMILES | [Ni]12([P](C[B](c3ccccc3)(C[P]1(c1ccccc1)c1ccccc1)C[P]2(c1ccccc1)c1ccccc1)(c1ccccc1)c1ccccc1)N=O |
Title of publication | The Coordination Chemistry of "[BP3]NiX" Platforms: Targeting Low-Valent Nickel Sources as Promising Candidates to L3NiE and L3Ni\τbE Linkages |
Authors of publication | Cora E. MacBeth; J. Christopher Thomas; Theodore A. Betley; Jonas C. Peters |
Journal of publication | Inorganic Chemistry |
Year of publication | 2004 |
Journal volume | 43 |
Pages of publication | 4645 - 4662 |
a | 39.359 ± 0.004 Å |
b | 12.9396 ± 0.0013 Å |
c | 16.1218 ± 0.0016 Å |
α | 90° |
β | 110.668 ± 0.002° |
γ | 90° |
Cell volume | 7682.2 ± 1.3 Å3 |
Cell temperature | 96 ± 2 K |
Ambient diffraction temperature | 96 ± 2 K |
Number of distinct elements | 7 |
Space group number | 15 |
Hermann-Mauguin space group symbol | C 1 2/c 1 |
Hall space group symbol | -C 2yc |
Residual factor for all reflections | 0.0951 |
Residual factor for significantly intense reflections | 0.0492 |
Weighted residual factors for significantly intense reflections | 0.0717 |
Weighted residual factors for all reflections included in the refinement | 0.0788 |
Goodness-of-fit parameter for all reflections included in the refinement | 1.11 |
Diffraction radiation wavelength | 0.71073 Å |
Diffraction radiation type | MoKα |