Information card for entry 4311385
Formula | C48 H31 Ag2 Cl2 N5 O8 |
Calculated formula | C48 H31 Ag2 Cl2 N5 O8 |
Title of publication | Structural Characterization and Luminescence Behavior of a Silver(I) 1D Polymeric Chain Constructed via a Bridge with Unusual 4,5-Diazospirobifluorene and Perchlorate |
Authors of publication | Chih-Chieh Wang; Cheng-Han Yang; Shih-Min Tseng; Sue-Yi Lin; Ti-Yu Wu; Ming-Ren Fuh; Gene-Hsiang Lee; Ken-Tsung Wong; Ruei-Tang Chen; Yi-Ming Cheng; Pi-Tai Chou |
Journal of publication | Inorganic Chemistry |
Year of publication | 2004 |
Journal volume | 43 |
Pages of publication | 4781 - 4783 |
a | 14.7025 ± 0.0002 Å |
b | 16.2288 ± 0.0002 Å |
c | 35.662 ± 0.0005 Å |
α | 90° |
β | 90° |
γ | 90° |
Cell volume | 8509.1 ± 0.2 Å3 |
Cell temperature | 150 ± 1 K |
Ambient diffraction temperature | 150 ± 1 K |
Number of distinct elements | 6 |
Space group number | 73 |
Hermann-Mauguin space group symbol | I b c a |
Hall space group symbol | -I 2b 2c |
Residual factor for all reflections | 0.1041 |
Residual factor for significantly intense reflections | 0.0714 |
Weighted residual factors for significantly intense reflections | 0.1851 |
Weighted residual factors for all reflections included in the refinement | 0.2118 |
Goodness-of-fit parameter for all reflections included in the refinement | 1.127 |
Diffraction radiation wavelength | 0.71073 Å |
Diffraction radiation type | MoKα |