Information card for entry 4314800
Formula | C35 H36 B2 F8 P2 Pt S Se |
Calculated formula | C35 H36 B2 F8 P2 Pt S Se |
Title of publication | Selective Formation of Heteroligated Pt(II) Complexes with Bidentate Phosphine-Thioether (P,S) and Phosphine-Selenoether (P,Se) Ligands via the Halide-Induced Ligand Rearrangement Reaction |
Authors of publication | Alexander M. Spokoyny; Mari S. Rosen; Pirmin A. Ulmann; Charlotte Stern; Chad A. Mirkin |
Journal of publication | Inorganic Chemistry |
Year of publication | 2010 |
Journal volume | 49 |
Pages of publication | 1577 - 1586 |
a | 37.375 ± 0.004 Å |
b | 13.3976 ± 0.0015 Å |
c | 17.394 ± 0.002 Å |
α | 90° |
β | 114.81 ± 0.013° |
γ | 90° |
Cell volume | 7905.9 ± 1.7 Å3 |
Cell temperature | 100 ± 2 K |
Ambient diffraction temperature | 100 ± 2 K |
Number of distinct elements | 8 |
Space group number | 15 |
Hermann-Mauguin space group symbol | C 1 2/c 1 |
Hall space group symbol | -C 2yc |
Residual factor for all reflections | 0.0823 |
Residual factor for significantly intense reflections | 0.0646 |
Weighted residual factors for significantly intense reflections | 0.146 |
Weighted residual factors for all reflections included in the refinement | 0.151 |
Goodness-of-fit parameter for all reflections included in the refinement | 1.059 |
Diffraction radiation wavelength | 0.71073 Å |
Diffraction radiation type | MoKα |