Information card for entry 4314834
Formula | Ca1.6 Eu2.4 Ge4 In3 |
Calculated formula | Ca1.6 Eu2.4 Ge4 In3 |
Title of publication | Mixed Cations and Structural Complexity in (Eu1-xCax)4In3Ge4 and (Eu1-xCax)3In2Ge3-The First Two Members of the Homologous Series A2[n+m]In2n+mGe2[n+m] (n,m= 1, 2, ...\ιnfty; A = Ca, Sr, Ba, Eu, or Yb) |
Authors of publication | Tae-Soo You; Paul H. Tobash; Svilen Bobev |
Journal of publication | Inorganic Chemistry |
Year of publication | 2010 |
Journal volume | 49 |
Pages of publication | 1773 - 1783 |
a | 17.011 ± 0.0015 Å |
b | 4.5553 ± 0.0003 Å |
c | 7.5393 ± 0.0008 Å |
α | 90° |
β | 107.618 ± 0.002° |
γ | 90° |
Cell volume | 556.82 ± 0.09 Å3 |
Cell temperature | 200 ± 2 K |
Ambient diffraction temperature | 200 ± 2 K |
Number of distinct elements | 4 |
Space group number | 12 |
Hermann-Mauguin space group symbol | C 1 2/m 1 |
Hall space group symbol | -C 2y |
Residual factor for all reflections | 0.0501 |
Residual factor for significantly intense reflections | 0.0358 |
Weighted residual factors for significantly intense reflections | 0.0661 |
Weighted residual factors for all reflections included in the refinement | 0.072 |
Goodness-of-fit parameter for all reflections included in the refinement | 1.023 |
Diffraction radiation wavelength | 0.71073 Å |
Diffraction radiation type | MoKα |