Information card for entry 4314835
Formula | Ca1.86 Eu2.14 Ge4 In3 |
Calculated formula | Ca1.861 Eu2.139 Ge4 In3 |
Title of publication | Mixed Cations and Structural Complexity in (Eu1-xCax)4In3Ge4 and (Eu1-xCax)3In2Ge3-The First Two Members of the Homologous Series A2[n+m]In2n+mGe2[n+m] (n,m= 1, 2, ...\ιnfty; A = Ca, Sr, Ba, Eu, or Yb) |
Authors of publication | Tae-Soo You; Paul H. Tobash; Svilen Bobev |
Journal of publication | Inorganic Chemistry |
Year of publication | 2010 |
Journal volume | 49 |
Pages of publication | 1773 - 1783 |
a | 16.9981 ± 0.0016 Å |
b | 4.5493 ± 0.0006 Å |
c | 7.5308 ± 0.0003 Å |
α | 90° |
β | 107.611 ± 0.002° |
γ | 90° |
Cell volume | 555.06 ± 0.09 Å3 |
Cell temperature | 200 ± 2 K |
Ambient diffraction temperature | 200 ± 2 K |
Number of distinct elements | 4 |
Space group number | 12 |
Hermann-Mauguin space group symbol | C 1 2/m 1 |
Hall space group symbol | -C 2y |
Residual factor for all reflections | 0.0271 |
Residual factor for significantly intense reflections | 0.0229 |
Weighted residual factors for significantly intense reflections | 0.0478 |
Weighted residual factors for all reflections included in the refinement | 0.0488 |
Goodness-of-fit parameter for all reflections included in the refinement | 1.04 |
Diffraction radiation wavelength | 0.71073 Å |
Diffraction radiation type | MoKα |