Information card for entry 4314914
Formula | C4 H4 O10 U |
Calculated formula | C4 H4 O10 U |
Title of publication | X-Ray Diffraction and μ-Raman Investigation of the Monoclinic-Orthorhombic Phase Transition in Th1-xUx(C2O4)2.2H2O Solid Solutions |
Authors of publication | Nicolas Clavier; Nina Hingant; Murielle Rivenet; Saïd Obbade; Nicolas Dacheux; Nicole Barré; Francis Abraham |
Journal of publication | Inorganic Chemistry |
Year of publication | 2010 |
Journal volume | 49 |
Pages of publication | 1921 - 1931 |
a | 10.4213 ± 0.0007 Å |
b | 8.4586 ± 0.0006 Å |
c | 9.529 ± 0.0007 Å |
α | 90° |
β | 90.082 ± 0.004° |
γ | 90° |
Cell volume | 839.98 ± 0.1 Å3 |
Cell temperature | 296 ± 2 K |
Ambient diffraction temperature | 296 ± 2 K |
Number of distinct elements | 4 |
Space group number | 15 |
Hermann-Mauguin space group symbol | C 1 2/c 1 |
Hall space group symbol | -C 2yc |
Residual factor for all reflections | 0.0358 |
Residual factor for significantly intense reflections | 0.0171 |
Weighted residual factors for significantly intense reflections | 0.028 |
Weighted residual factors for all reflections included in the refinement | 0.0319 |
Goodness-of-fit parameter for all reflections included in the refinement | 1.027 |
Diffraction radiation wavelength | 0.71073 Å |
Diffraction radiation type | MoKα |