Information card for entry 4314915
Formula | C4 H4 O10 Th0.5 U0.5 |
Calculated formula | C4 H4 O10 Th0.5 U0.5 |
Title of publication | X-Ray Diffraction and μ-Raman Investigation of the Monoclinic-Orthorhombic Phase Transition in Th1-xUx(C2O4)2.2H2O Solid Solutions |
Authors of publication | Nicolas Clavier; Nina Hingant; Murielle Rivenet; Saïd Obbade; Nicolas Dacheux; Nicole Barré; Francis Abraham |
Journal of publication | Inorganic Chemistry |
Year of publication | 2010 |
Journal volume | 49 |
Pages of publication | 1921 - 1931 |
a | 10.484 ± 0.002 Å |
b | 8.5344 ± 0.0017 Å |
c | 9.5975 ± 0.0019 Å |
α | 90° |
β | 90° |
γ | 90° |
Cell volume | 858.7 ± 0.3 Å3 |
Cell temperature | 363 ± 2 K |
Ambient diffraction temperature | 363 ± 2 K |
Number of distinct elements | 5 |
Space group number | 68 |
Hermann-Mauguin space group symbol | C c c b :1 |
Hall space group symbol | C 2 2 -1ac |
Residual factor for all reflections | 0.0432 |
Residual factor for significantly intense reflections | 0.0212 |
Weighted residual factors for significantly intense reflections | 0.0378 |
Weighted residual factors for all reflections included in the refinement | 0.0415 |
Goodness-of-fit parameter for all reflections included in the refinement | 1.106 |
Diffraction radiation wavelength | 0.71073 Å |
Diffraction radiation type | MoKα |