Information card for entry 4314947
Formula | C31 H29 Fe0.5 Mn N5 O4 |
Calculated formula | C31 H29 Fe0.5 Mn N5 O4 |
Title of publication | Bimetallic Materials Derived from Manganese(III) Schiff Base Complexes and Pentacyanidonitrosylferrate(II) Precursor: Structures and Magnetic Properties |
Authors of publication | Chun Yang; Qing-Lun Wang; Yue Ma; Guo-Tao Tang; Dai-Zheng Liao; Shi-Ping Yan; Guang-Ming Yang; Peng Cheng |
Journal of publication | Inorganic Chemistry |
Year of publication | 2010 |
Journal volume | 49 |
Pages of publication | 2047 - 2056 |
a | 10.861 ± 0.002 Å |
b | 16.462 ± 0.003 Å |
c | 16.068 ± 0.003 Å |
α | 90° |
β | 103.94 ± 0.03° |
γ | 90° |
Cell volume | 2788.2 ± 1 Å3 |
Cell temperature | 293 ± 2 K |
Ambient diffraction temperature | 293 ± 2 K |
Number of distinct elements | 6 |
Space group number | 14 |
Hermann-Mauguin space group symbol | P 1 21/n 1 |
Hall space group symbol | -P 2yn |
Residual factor for all reflections | 0.1181 |
Residual factor for significantly intense reflections | 0.0822 |
Weighted residual factors for significantly intense reflections | 0.1299 |
Weighted residual factors for all reflections included in the refinement | 0.1412 |
Goodness-of-fit parameter for all reflections included in the refinement | 1.182 |
Diffraction radiation wavelength | 0.71073 Å |
Diffraction radiation type | MoKα |