Information card for entry 4314948
Formula | C37 H30 Fe Mn2 N10 O6 |
Calculated formula | C37 H28 Fe Mn2 N10 O6 |
Title of publication | Bimetallic Materials Derived from Manganese(III) Schiff Base Complexes and Pentacyanidonitrosylferrate(II) Precursor: Structures and Magnetic Properties |
Authors of publication | Chun Yang; Qing-Lun Wang; Yue Ma; Guo-Tao Tang; Dai-Zheng Liao; Shi-Ping Yan; Guang-Ming Yang; Peng Cheng |
Journal of publication | Inorganic Chemistry |
Year of publication | 2010 |
Journal volume | 49 |
Pages of publication | 2047 - 2056 |
a | 14.767 ± 0.002 Å |
b | 14.767 ± 0.002 Å |
c | 17.024 ± 0.003 Å |
α | 90° |
β | 90° |
γ | 90° |
Cell volume | 3712.3 ± 1 Å3 |
Cell temperature | 113 ± 2 K |
Ambient diffraction temperature | 113 ± 2 K |
Number of distinct elements | 6 |
Space group number | 130 |
Hermann-Mauguin space group symbol | P 4/n c c :2 |
Hall space group symbol | -P 4a 2ac |
Residual factor for all reflections | 0.0544 |
Residual factor for significantly intense reflections | 0.0536 |
Weighted residual factors for significantly intense reflections | 0.1421 |
Weighted residual factors for all reflections included in the refinement | 0.1427 |
Goodness-of-fit parameter for all reflections included in the refinement | 1.144 |
Diffraction radiation wavelength | 0.71073 Å |
Diffraction radiation type | MoKα |