Information card for entry 4316630
Chemical name | trichloro(1,2-bis(methylsulfanyl)benzene)bismuth(III) |
Formula | C8 H10 Bi Cl3 S2 |
Calculated formula | C8 H10 Bi Cl3 S2 |
Title of publication | Structural Diversity in Supramolecular Complexes of MCl3 (M = As, Sb, Bi) with Constrained Thio- and Seleno-Ether Ligands |
Authors of publication | William Levason; Seema Maheshwari; Raju Ratnani; Gillian Reid; Michael Webster; Wenjian Zhang |
Journal of publication | Inorganic Chemistry |
Year of publication | 2010 |
Journal volume | 49 |
Pages of publication | 9036 - 9048 |
a | 8.9791 ± 0.001 Å |
b | 7.2095 ± 0.001 Å |
c | 20.905 ± 0.002 Å |
α | 90° |
β | 98.574 ± 0.01° |
γ | 90° |
Cell volume | 1338.2 ± 0.3 Å3 |
Cell temperature | 120 ± 2 K |
Ambient diffraction temperature | 120 ± 2 K |
Number of distinct elements | 5 |
Space group number | 14 |
Hermann-Mauguin space group symbol | P 1 21/c 1 |
Hall space group symbol | -P 2ybc |
Residual factor for all reflections | 0.0341 |
Residual factor for significantly intense reflections | 0.0252 |
Weighted residual factors for significantly intense reflections | 0.0544 |
Weighted residual factors for all reflections included in the refinement | 0.0606 |
Goodness-of-fit parameter for all reflections included in the refinement | 1.128 |
Diffraction radiation wavelength | 0.71073 Å |
Diffraction radiation type | MoKα |