Information card for entry 4316631
Chemical name | trichloro(1,2-bis(methylsulfanyl)benzene)antimony(III) |
Formula | C8 H10 Cl3 S2 Sb |
Calculated formula | C8 H10 Cl3 S2 Sb |
Title of publication | Structural Diversity in Supramolecular Complexes of MCl3 (M = As, Sb, Bi) with Constrained Thio- and Seleno-Ether Ligands |
Authors of publication | William Levason; Seema Maheshwari; Raju Ratnani; Gillian Reid; Michael Webster; Wenjian Zhang |
Journal of publication | Inorganic Chemistry |
Year of publication | 2010 |
Journal volume | 49 |
Pages of publication | 9036 - 9048 |
a | 7.538 ± 0.003 Å |
b | 17.065 ± 0.009 Å |
c | 10.559 ± 0.005 Å |
α | 90° |
β | 105.11 ± 0.03° |
γ | 90° |
Cell volume | 1311.3 ± 1.1 Å3 |
Cell temperature | 120 ± 2 K |
Ambient diffraction temperature | 120 ± 2 K |
Number of distinct elements | 5 |
Space group number | 14 |
Hermann-Mauguin space group symbol | P 1 21/n 1 |
Hall space group symbol | -P 2yn |
Residual factor for all reflections | 0.0985 |
Residual factor for significantly intense reflections | 0.0525 |
Weighted residual factors for significantly intense reflections | 0.0951 |
Weighted residual factors for all reflections included in the refinement | 0.1092 |
Goodness-of-fit parameter for all reflections included in the refinement | 1.023 |
Diffraction radiation wavelength | 0.71073 Å |
Diffraction radiation type | MoKα |