Information card for entry 4316632
Chemical name | trichloro(1,2-bis(methylselanyl)benzene)bismuth(III) |
Formula | C8 H10 Bi Cl3 Se2 |
Calculated formula | C8 H10 Bi Cl3 Se2 |
Title of publication | Structural Diversity in Supramolecular Complexes of MCl3 (M = As, Sb, Bi) with Constrained Thio- and Seleno-Ether Ligands |
Authors of publication | William Levason; Seema Maheshwari; Raju Ratnani; Gillian Reid; Michael Webster; Wenjian Zhang |
Journal of publication | Inorganic Chemistry |
Year of publication | 2010 |
Journal volume | 49 |
Pages of publication | 9036 - 9048 |
a | 7.701 ± 0.003 Å |
b | 12.409 ± 0.004 Å |
c | 14.026 ± 0.006 Å |
α | 90° |
β | 90° |
γ | 90° |
Cell volume | 1340.3 ± 0.9 Å3 |
Cell temperature | 120 ± 2 K |
Ambient diffraction temperature | 120 ± 2 K |
Number of distinct elements | 5 |
Space group number | 62 |
Hermann-Mauguin space group symbol | P n m a |
Hall space group symbol | -P 2ac 2n |
Residual factor for all reflections | 0.0558 |
Residual factor for significantly intense reflections | 0.0418 |
Weighted residual factors for significantly intense reflections | 0.0822 |
Weighted residual factors for all reflections included in the refinement | 0.0905 |
Goodness-of-fit parameter for all reflections included in the refinement | 1.135 |
Diffraction radiation wavelength | 0.71073 Å |
Diffraction radiation type | MoKα |