Information card for entry 4322357
Formula | C132 H164 Cl4 I2 N10 Rh2 |
Calculated formula | C132 H164 Cl4 I2 N10 Rh2 |
Title of publication | Synthesis, Structure, and Modeling of a Cyclic Rhodium(III) Porphyrin Dimer with an Encapsulated 4,4'-Bipyridine Ligand |
Authors of publication | Hee-Joon Kim; James E. Redman; Moshe Nakash; Neil Feeder; Simon J. Teat; Jeremy K. M. Sanders |
Journal of publication | Inorganic Chemistry |
Year of publication | 1999 |
Journal volume | 38 |
Pages of publication | 5178 - 5183 |
a | 15.207 ± 0.002 Å |
b | 17.479 ± 0.002 Å |
c | 12.347 ± 0.002 Å |
α | 110.27 ± 0.02° |
β | 90.74 ± 0.02° |
γ | 95.93 ± 0.02° |
Cell volume | 3058 ± 0.8 Å3 |
Cell temperature | 180 ± 2 K |
Ambient diffraction temperature | 180 ± 2 K |
Number of distinct elements | 6 |
Space group number | 2 |
Hermann-Mauguin space group symbol | P -1 |
Hall space group symbol | -P 1 |
Residual factor for all reflections | 0.0643 |
Residual factor for significantly intense reflections | 0.0476 |
Weighted residual factors for significantly intense reflections | 0.1179 |
Weighted residual factors for all reflections included in the refinement | 0.1296 |
Goodness-of-fit parameter for all reflections included in the refinement | 1.102 |
Diffraction radiation wavelength | 0.71073 Å |
Diffraction radiation type | MoKα |