Information card for entry 4322482
Formula | C25.1 H30.6 N O2.7 P Re S2 |
Calculated formula | C25.1 H27 N O2.7 P Re S2 |
Title of publication | Novel Six-Coordinate Oxorhenium "3 + 2" Mixed-Ligand Complexes Carrying the SNS/PO Donor Atom Set: Synthesis and Characterization |
Authors of publication | Berthold Nock; Theodosia Maina; Francesco Tisato; Minas Papadopoulos; Catherine P. Raptopoulou; Aris Terzis; Efstratios Chiotellis |
Journal of publication | Inorganic Chemistry |
Year of publication | 1999 |
Journal volume | 38 |
Pages of publication | 4197 - 4202 |
a | 14.96 ± 0.007 Å |
b | 10.187 ± 0.004 Å |
c | 17.91 ± 0.008 Å |
α | 90° |
β | 93.36 ± 0.01° |
γ | 90° |
Cell volume | 2725 ± 2 Å3 |
Cell temperature | 298 K |
Ambient diffraction temperature | 298 K |
Number of distinct elements | 7 |
Space group number | 14 |
Hermann-Mauguin space group symbol | P 1 21/c 1 |
Hall space group symbol | -P 2ybc |
Residual factor for all reflections | 0.0485 |
Residual factor for significantly intense reflections | 0.0335 |
Weighted residual factors for all reflections | 0.0951 |
Weighted residual factors for significantly intense reflections | 0.0855 |
Goodness-of-fit parameter for all reflections | 1.104 |
Goodness-of-fit parameter for significantly intense reflections | 1.115 |
Diffraction radiation wavelength | 0.71073 Å |
Diffraction radiation type | MoKα |