Information card for entry 4324197
Formula | C12 H25 B18 Co O S8 |
Calculated formula | C12 H25 B18 Co O S8 |
Title of publication | Molecular Conductors with a 8-Hydroxy cobalt Bis(dicarbollide) Anion |
Authors of publication | Olga N. Kazheva; Grigorii G. Alexandrov; Andrey V. Kravchenko; Irina D. Kosenko; Irina A. Lobanova; Igor B. Sivaev; Oleg A. Filippov; Elena S. Shubina; Vladimir I. Bregadze; Vladimir A. Starodub; Lev V. Titov; Lev I. Buravov; Oleg A. Dyachenko |
Journal of publication | Inorganic Chemistry |
Year of publication | 2011 |
Journal volume | 50 |
Pages of publication | 444 - 450 |
a | 6.9493 ± 0.0011 Å |
b | 9.4839 ± 0.0014 Å |
c | 11.9299 ± 0.0018 Å |
α | 73.484 ± 0.002° |
β | 78.815 ± 0.002° |
γ | 78.014 ± 0.002° |
Cell volume | 729.71 ± 0.19 Å3 |
Cell temperature | 296 ± 2 K |
Ambient diffraction temperature | 296 ± 2 K |
Number of distinct elements | 6 |
Space group number | 2 |
Hermann-Mauguin space group symbol | P -1 |
Hall space group symbol | -P 1 |
Residual factor for all reflections | 0.0968 |
Residual factor for significantly intense reflections | 0.0479 |
Weighted residual factors for significantly intense reflections | 0.0673 |
Weighted residual factors for all reflections included in the refinement | 0.0771 |
Goodness-of-fit parameter for all reflections included in the refinement | 0.866 |
Diffraction radiation wavelength | 0.71073 Å |
Diffraction radiation type | MoKα |