Information card for entry 4324198
Formula | C14 H29 B18 Co O S8 |
Calculated formula | C14 H29 B18 Co O S8 |
Title of publication | Molecular Conductors with a 8-Hydroxy cobalt Bis(dicarbollide) Anion |
Authors of publication | Olga N. Kazheva; Grigorii G. Alexandrov; Andrey V. Kravchenko; Irina D. Kosenko; Irina A. Lobanova; Igor B. Sivaev; Oleg A. Filippov; Elena S. Shubina; Vladimir I. Bregadze; Vladimir A. Starodub; Lev V. Titov; Lev I. Buravov; Oleg A. Dyachenko |
Journal of publication | Inorganic Chemistry |
Year of publication | 2011 |
Journal volume | 50 |
Pages of publication | 444 - 450 |
a | 6.7512 ± 0.0005 Å |
b | 38.284 ± 0.003 Å |
c | 11.6564 ± 0.0008 Å |
α | 90° |
β | 91.846 ± 0.002° |
γ | 90° |
Cell volume | 3011.2 ± 0.4 Å3 |
Cell temperature | 296 ± 2 K |
Ambient diffraction temperature | 296 ± 2 K |
Number of distinct elements | 6 |
Space group number | 14 |
Hermann-Mauguin space group symbol | P 1 21/n 1 |
Hall space group symbol | -P 2yn |
Residual factor for all reflections | 0.0611 |
Residual factor for significantly intense reflections | 0.0468 |
Weighted residual factors for significantly intense reflections | 0.1077 |
Weighted residual factors for all reflections included in the refinement | 0.1132 |
Goodness-of-fit parameter for all reflections included in the refinement | 1.075 |
Diffraction radiation wavelength | 0.71073 Å |
Diffraction radiation type | MoKα |