Information card for entry 4324205
Formula | C8 H8 Cl Mo N3 O5 |
Calculated formula | C8 H8 Cl Mo N3 O5 |
SMILES | [Mo]12(Cl)(=O)(OO1)OO2.[nH]1nc(cc1)c1[nH+]cccc1 |
Title of publication | Chemistry and Catalytic Activity of Molybdenum(VI)-Pyrazolylpyridine Complexes in Olefin Epoxidation. Crystal Structures of Monomeric Dioxo, Dioxo-μ-oxo, and Oxodiperoxo Derivatives |
Authors of publication | Ana C. Coelho; Mariela Nolasco; Salete S. Balula; Margarida M. Antunes; Cláudia C. L. Pereira; Filipe A. Almeida Paz; Anabela A. Valente; Martyn Pillinger; Paulo Ribeiro-Claro; Jacek Klinowski; Isabel S. Gonçalves |
Journal of publication | Inorganic Chemistry |
Year of publication | 2011 |
Journal volume | 50 |
Pages of publication | 525 - 538 |
a | 8.9171 ± 0.0015 Å |
b | 6.6239 ± 0.001 Å |
c | 19.872 ± 0.003 Å |
α | 90° |
β | 97.371 ± 0.007° |
γ | 90° |
Cell volume | 1164.1 ± 0.3 Å3 |
Cell temperature | 100 ± 2 K |
Ambient diffraction temperature | 100 ± 2 K |
Number of distinct elements | 6 |
Space group number | 14 |
Hermann-Mauguin space group symbol | P 1 21/c 1 |
Hall space group symbol | -P 2ybc |
Residual factor for all reflections | 0.0627 |
Residual factor for significantly intense reflections | 0.0575 |
Weighted residual factors for significantly intense reflections | 0.1466 |
Weighted residual factors for all reflections included in the refinement | 0.1487 |
Goodness-of-fit parameter for all reflections included in the refinement | 1.255 |
Diffraction radiation wavelength | 0.71073 Å |
Diffraction radiation type | MoKα |