Information card for entry 4324206
Formula | C44 H37 Mo N3 O4 Si2 |
Calculated formula | C44 H37 Mo N3 O4 Si2 |
Title of publication | Chemistry and Catalytic Activity of Molybdenum(VI)-Pyrazolylpyridine Complexes in Olefin Epoxidation. Crystal Structures of Monomeric Dioxo, Dioxo-μ-oxo, and Oxodiperoxo Derivatives |
Authors of publication | Ana C. Coelho; Mariela Nolasco; Salete S. Balula; Margarida M. Antunes; Cláudia C. L. Pereira; Filipe A. Almeida Paz; Anabela A. Valente; Martyn Pillinger; Paulo Ribeiro-Claro; Jacek Klinowski; Isabel S. Gonçalves |
Journal of publication | Inorganic Chemistry |
Year of publication | 2011 |
Journal volume | 50 |
Pages of publication | 525 - 538 |
a | 9.3906 ± 0.0019 Å |
b | 26.954 ± 0.005 Å |
c | 15.527 ± 0.003 Å |
α | 90° |
β | 96.07 ± 0.03° |
γ | 90° |
Cell volume | 3908.1 ± 1.3 Å3 |
Cell temperature | 180 ± 2 K |
Ambient diffraction temperature | 180 ± 2 K |
Number of distinct elements | 6 |
Space group number | 14 |
Hermann-Mauguin space group symbol | P 1 21/n 1 |
Hall space group symbol | -P 2yn |
Residual factor for all reflections | 0.097 |
Residual factor for significantly intense reflections | 0.0663 |
Weighted residual factors for significantly intense reflections | 0.1331 |
Weighted residual factors for all reflections included in the refinement | 0.1475 |
Goodness-of-fit parameter for all reflections included in the refinement | 1.089 |
Diffraction radiation wavelength | 0.71073 Å |
Diffraction radiation type | MoKα |