Information card for entry 4324278
Formula | H O5 Pr S |
Calculated formula | H O5 Pr S |
SMILES | [Pr+3].[OH-].S(=O)(=O)([O-])[O-] |
Title of publication | Effect of Inclining Strain on the Crystal Lattice along an Extended Series of Lanthanide Hydroxysulfates Ln(OH)SO4 (Ln = Pr-Yb, except Pm) |
Authors of publication | Ralph A. Zehnder; Christopher S. Wilson; Hunter T. Christy; Kenneth S. Harris; Varun Chauhan; Victor Schutz; Matthew Sullivan; Matthias Zeller; Frank R. Fronczek; Jacob A. Myers; Kyle Dammann; James Duck; Peter M. Smith; Antony Okuma; Kristin Johnson; Robert Sovesky; Cameron Stroudt; Robert A. Renn |
Journal of publication | Inorganic Chemistry |
Year of publication | 2011 |
Journal volume | 50 |
Pages of publication | 836 - 846 |
a | 4.4933 ± 0.0008 Å |
b | 12.4922 ± 0.0015 Å |
c | 6.8613 ± 0.001 Å |
α | 90° |
β | 106.335 ± 0.007° |
γ | 90° |
Cell volume | 369.59 ± 0.1 Å3 |
Cell temperature | 90 ± 0.5 K |
Ambient diffraction temperature | 90 ± 0.5 K |
Number of distinct elements | 4 |
Space group number | 14 |
Hermann-Mauguin space group symbol | P 1 21/n 1 |
Hall space group symbol | -P 2yn |
Residual factor for all reflections | 0.031 |
Residual factor for significantly intense reflections | 0.027 |
Weighted residual factors for significantly intense reflections | 0.067 |
Weighted residual factors for all reflections included in the refinement | 0.069 |
Goodness-of-fit parameter for all reflections included in the refinement | 1.087 |
Diffraction radiation wavelength | 0.71073 Å |
Diffraction radiation type | MoKα |