Information card for entry 4324279
Formula | H Nd O5 S |
Calculated formula | H Nd O5 S |
SMILES | [Nd+3].[OH-].S(=O)(=O)([O-])[O-] |
Title of publication | Effect of Inclining Strain on the Crystal Lattice along an Extended Series of Lanthanide Hydroxysulfates Ln(OH)SO4 (Ln = Pr-Yb, except Pm) |
Authors of publication | Ralph A. Zehnder; Christopher S. Wilson; Hunter T. Christy; Kenneth S. Harris; Varun Chauhan; Victor Schutz; Matthew Sullivan; Matthias Zeller; Frank R. Fronczek; Jacob A. Myers; Kyle Dammann; James Duck; Peter M. Smith; Antony Okuma; Kristin Johnson; Robert Sovesky; Cameron Stroudt; Robert A. Renn |
Journal of publication | Inorganic Chemistry |
Year of publication | 2011 |
Journal volume | 50 |
Pages of publication | 836 - 846 |
a | 4.4733 ± 0.001 Å |
b | 12.432 ± 0.002 Å |
c | 6.8346 ± 0.0012 Å |
α | 90° |
β | 106.396 ± 0.009° |
γ | 90° |
Cell volume | 364.63 ± 0.12 Å3 |
Cell temperature | 90 ± 0.5 K |
Ambient diffraction temperature | 90 ± 0.5 K |
Number of distinct elements | 4 |
Space group number | 14 |
Hermann-Mauguin space group symbol | P 1 21/n 1 |
Hall space group symbol | -P 2yn |
Residual factor for all reflections | 0.041 |
Residual factor for significantly intense reflections | 0.037 |
Weighted residual factors for significantly intense reflections | 0.095 |
Weighted residual factors for all reflections included in the refinement | 0.102 |
Goodness-of-fit parameter for all reflections included in the refinement | 1.043 |
Diffraction radiation wavelength | 0.71073 Å |
Diffraction radiation type | MoKα |