Information card for entry 4324286
Formula | Er H O5 S |
Calculated formula | Er H O5 S |
SMILES | [Er+3].[OH-].S(=O)(=O)([O-])[O-] |
Title of publication | Effect of Inclining Strain on the Crystal Lattice along an Extended Series of Lanthanide Hydroxysulfates Ln(OH)SO4 (Ln = Pr-Yb, except Pm) |
Authors of publication | Ralph A. Zehnder; Christopher S. Wilson; Hunter T. Christy; Kenneth S. Harris; Varun Chauhan; Victor Schutz; Matthew Sullivan; Matthias Zeller; Frank R. Fronczek; Jacob A. Myers; Kyle Dammann; James Duck; Peter M. Smith; Antony Okuma; Kristin Johnson; Robert Sovesky; Cameron Stroudt; Robert A. Renn |
Journal of publication | Inorganic Chemistry |
Year of publication | 2011 |
Journal volume | 50 |
Pages of publication | 836 - 846 |
a | 7.9548 ± 0.0012 Å |
b | 10.8906 ± 0.0015 Å |
c | 8.088 ± 0.0012 Å |
α | 90° |
β | 93.874 ± 0.009° |
γ | 90° |
Cell volume | 699.08 ± 0.18 Å3 |
Cell temperature | 90 ± 0.5 K |
Ambient diffraction temperature | 90 ± 0.5 K |
Number of distinct elements | 4 |
Space group number | 14 |
Hermann-Mauguin space group symbol | P 1 21/n 1 |
Hall space group symbol | -P 2yn |
Residual factor for all reflections | 0.068 |
Residual factor for significantly intense reflections | 0.043 |
Weighted residual factors for significantly intense reflections | 0.088 |
Weighted residual factors for all reflections included in the refinement | 0.096 |
Goodness-of-fit parameter for all reflections included in the refinement | 0.987 |
Diffraction radiation wavelength | 0.71073 Å |
Diffraction radiation type | MoKα |