Information card for entry 4324287
Formula | H O5 S Tm |
Calculated formula | H O5 S Tm |
SMILES | [Tm+3].[OH-].S(=O)(=O)([O-])[O-] |
Title of publication | Effect of Inclining Strain on the Crystal Lattice along an Extended Series of Lanthanide Hydroxysulfates Ln(OH)SO4 (Ln = Pr-Yb, except Pm) |
Authors of publication | Ralph A. Zehnder; Christopher S. Wilson; Hunter T. Christy; Kenneth S. Harris; Varun Chauhan; Victor Schutz; Matthew Sullivan; Matthias Zeller; Frank R. Fronczek; Jacob A. Myers; Kyle Dammann; James Duck; Peter M. Smith; Antony Okuma; Kristin Johnson; Robert Sovesky; Cameron Stroudt; Robert A. Renn |
Journal of publication | Inorganic Chemistry |
Year of publication | 2011 |
Journal volume | 50 |
Pages of publication | 836 - 846 |
a | 7.9064 ± 0.0018 Å |
b | 10.81 ± 0.002 Å |
c | 8.0439 ± 0.0018 Å |
α | 90° |
β | 93.838 ± 0.003° |
γ | 90° |
Cell volume | 686 ± 0.3 Å3 |
Cell temperature | 100 ± 2 K |
Ambient diffraction temperature | 100 ± 2 K |
Number of distinct elements | 4 |
Space group number | 14 |
Hermann-Mauguin space group symbol | P 1 21/n 1 |
Hall space group symbol | -P 2yn |
Residual factor for all reflections | 0.0323 |
Residual factor for significantly intense reflections | 0.0231 |
Weighted residual factors for significantly intense reflections | 0.0498 |
Weighted residual factors for all reflections included in the refinement | 0.0548 |
Goodness-of-fit parameter for all reflections included in the refinement | 1.066 |
Diffraction radiation wavelength | 0.71073 Å |
Diffraction radiation type | MoKα |