Information card for entry 4324288
Formula | H O5 S Yb |
Calculated formula | H O5 S Yb |
SMILES | [Yb+3].[OH-].S(=O)(=O)([O-])[O-] |
Title of publication | Effect of Inclining Strain on the Crystal Lattice along an Extended Series of Lanthanide Hydroxysulfates Ln(OH)SO4 (Ln = Pr-Yb, except Pm) |
Authors of publication | Ralph A. Zehnder; Christopher S. Wilson; Hunter T. Christy; Kenneth S. Harris; Varun Chauhan; Victor Schutz; Matthew Sullivan; Matthias Zeller; Frank R. Fronczek; Jacob A. Myers; Kyle Dammann; James Duck; Peter M. Smith; Antony Okuma; Kristin Johnson; Robert Sovesky; Cameron Stroudt; Robert A. Renn |
Journal of publication | Inorganic Chemistry |
Year of publication | 2011 |
Journal volume | 50 |
Pages of publication | 836 - 846 |
a | 7.871 ± 0.003 Å |
b | 10.836 ± 0.004 Å |
c | 8.017 ± 0.003 Å |
α | 90° |
β | 93.986 ± 0.005° |
γ | 90° |
Cell volume | 682.1 ± 0.4 Å3 |
Cell temperature | 100 ± 2 K |
Ambient diffraction temperature | 100 ± 2 K |
Number of distinct elements | 4 |
Space group number | 14 |
Hermann-Mauguin space group symbol | P 1 21/n 1 |
Hall space group symbol | -P 2yn |
Residual factor for all reflections | 0.0376 |
Residual factor for significantly intense reflections | 0.0262 |
Weighted residual factors for significantly intense reflections | 0.0556 |
Weighted residual factors for all reflections included in the refinement | 0.0582 |
Goodness-of-fit parameter for all reflections included in the refinement | 1.031 |
Diffraction radiation wavelength | 0.71073 Å |
Diffraction radiation type | MoKα |