Information card for entry 4324317
Formula | C13 H15 Cu N5 O4 |
Calculated formula | C13 H15 Cu N5 O4 |
SMILES | c12c(ccc(c1)N(=O)=O)[N]1=NC(=C(C)N3[Cu]1([NH2]CC3)O2)C(=O)C |
Title of publication | Ortho-Hydroxyphenylhydrazo-β-Diketones: Tautomery, Coordination Ability, and Catalytic Activity of Their Copper(II) Complexes toward Oxidation of Cyclohexane and Benzylic Alcohols |
Authors of publication | Maximilian N. Kopylovich; Kamran T. Mahmudov; M. Fátima C. Guedes da Silva; PaweÅ‚ J. Figiel; Yauhen Yu. Karabach; Maxim L. Kuznetsov; Konstantin V. Luzyanin; Armando J. L. Pombeiro |
Journal of publication | Inorganic Chemistry |
Year of publication | 2011 |
Journal volume | 50 |
Pages of publication | 918 - 931 |
a | 9.3158 ± 0.0017 Å |
b | 11.64 ± 0.002 Å |
c | 13.057 ± 0.002 Å |
α | 90° |
β | 95.358 ± 0.007° |
γ | 90° |
Cell volume | 1409.7 ± 0.4 Å3 |
Cell temperature | 150 ± 2 K |
Ambient diffraction temperature | 150 ± 2 K |
Number of distinct elements | 5 |
Space group number | 14 |
Hermann-Mauguin space group symbol | P 1 21/n 1 |
Hall space group symbol | -P 2yn |
Residual factor for all reflections | 0.1808 |
Residual factor for significantly intense reflections | 0.0682 |
Weighted residual factors for significantly intense reflections | 0.1395 |
Weighted residual factors for all reflections included in the refinement | 0.197 |
Goodness-of-fit parameter for all reflections included in the refinement | 1.069 |
Diffraction radiation wavelength | 0.71069 Å |
Diffraction radiation type | MoKα |