Information card for entry 4324318
Formula | C13 H15 Cu N5 O4 |
Calculated formula | C13 H15 Cu N5 O4 |
SMILES | c12c(ccc(c1)N(=O)=O)N1[Cu]3([NH2]CC[N]3=C(C)C(=N1)C(=O)C)O2 |
Title of publication | Ortho-Hydroxyphenylhydrazo-β-Diketones: Tautomery, Coordination Ability, and Catalytic Activity of Their Copper(II) Complexes toward Oxidation of Cyclohexane and Benzylic Alcohols |
Authors of publication | Maximilian N. Kopylovich; Kamran T. Mahmudov; M. Fátima C. Guedes da Silva; PaweÅ‚ J. Figiel; Yauhen Yu. Karabach; Maxim L. Kuznetsov; Konstantin V. Luzyanin; Armando J. L. Pombeiro |
Journal of publication | Inorganic Chemistry |
Year of publication | 2011 |
Journal volume | 50 |
Pages of publication | 918 - 931 |
a | 9.8153 ± 0.0018 Å |
b | 15.232 ± 0.003 Å |
c | 9.3858 ± 0.0016 Å |
α | 90° |
β | 90.938 ± 0.006° |
γ | 90° |
Cell volume | 1403.1 ± 0.4 Å3 |
Cell temperature | 150 ± 2 K |
Ambient diffraction temperature | 150 ± 2 K |
Number of distinct elements | 5 |
Space group number | 14 |
Hermann-Mauguin space group symbol | P 1 21/c 1 |
Hall space group symbol | -P 2ybc |
Residual factor for all reflections | 0.0785 |
Residual factor for significantly intense reflections | 0.0441 |
Weighted residual factors for significantly intense reflections | 0.0992 |
Weighted residual factors for all reflections included in the refinement | 0.1278 |
Goodness-of-fit parameter for all reflections included in the refinement | 1.03 |
Diffraction radiation wavelength | 0.71073 Å |
Diffraction radiation type | MoKα |